{"text_format":"1","workbook":"xlsx","n_sheets":5,"sheets":["SSK_Spesenblatt","Doppelspiele","HallenlisteSVRBESO","schiedsrichterliste20211115","Regionen"],"not_rendered":{"charts":0,"images":6,"macros":1,"external_links":0,"defined_names":32,"comments":1,"pivot_tables":0},"unopened":[],"bounds":{"document_bytes":16777216,"sheet_cells":100000,"rows_first":2000,"rows_last":500,"rows_between":2000,"halvings":0,"cell_chars":16384,"cell_head_chars":4096},"cells_cut":0,"cells_raw":0,"read":"whole","date_system":"1900"}

{"sheet":"SSK_Spesenblatt","index":0,"n_rows":54,"n_cols":43,"rows_kept":54,"cut":false,"hidden":false,"merged":[[54,27,54,30],[25,28,25,30],[53,28,53,30],[54,31,54,33],[53,0,53,6],[53,7,53,24],[53,31,53,33],[46,30,46,31],[46,32,46,33],[50,29,51,30],[50,31,51,33],[52,0,52,28],[52,29,52,30],[52,31,52,33],[48,0,48,28],[48,29,48,30],[48,31,48,33],[49,0,49,28],[49,29,49,30],[49,31,49,33],[44,0,44,33],[45,0,45,33],[46,0,46,7],[46,26,46,28],[47,0,47,28],[42,0,43,2],[42,3,43,11],[42,12,43,12],[42,13,43,21],[42,31,43,33],[42,29,43,30],[47,30,47,31],[47,32,47,33],[40,0,40,2],[40,3,40,7],[40,10,40,11],[40,12,40,28],[40,29,40,30],[40,31,40,33],[34,0,34,11],[34,12,34,33],[36,0,36,11],[36,12,36,33],[38,0,38,2],[38,3,38,6],[38,8,38,11],[38,12,38,33],[26,0,26,33],[27,0,27,33],[28,0,32,6],[28,7,31,18],[28,19,29,33],[30,19,31,33],[24,0,24,28],[24,29,24,30],[24,31,24,33],[25,0,25,6],[25,7,25,24],[25,31,25,33],[21,0,21,28],[21,29,21,30],[21,31,21,33],[21,36,21,38],[22,29,23,30],[22,31,23,33],[23,36,23,40],[22,0,23,6],[22,7,23,28],[20,0,20,28],[20,29,20,30],[20,31,20,33],[16,0,16,33],[17,0,17,33],[17,36,18,38],[18,0,18,7],[18,26,18,28],[18,30,18,31],[18,32,18,33],[12,0,12,2],[12,3,12,7],[12,10,12,11],[12,12,12,28],[12,29,12,30],[12,31,12,33],[10,37,10,40],[14,29,15,30],[19,0,19,28],[19,30,19,31],[19,32,19,33],[19,36,19,38],[50,0,51,6],[50,7,51,28],[2,39,3,39],[6,0,6,11],[6,12,6,33],[8,0,8,11],[8,12,8,33],[8,37,8,40],[0,0,4,6],[0,7,3,18],[0,19,1,33],[2,19,3,33],[2,36,4,36],[2,37,4,37],[13,36,15,38],[14,0,15,2],[14,3,15,11],[14,12,15,12],[14,13,15,21],[14,31,15,33],[10,0,10,2],[10,3,10,6],[10,8,10,11],[10,12,10,33]]}
[null,null,null,null,null,null,null,{"$f":"IF(AND(Cup=\"X\",Sprache=\"Deutsch\"),\"SWISS CUP !                              Heimteam bezahlt alle Spesen\",IF(AND(Cup=\"X\",Sprache=\"Français\"),\"SWISS CUP !                                  L'équipe local paie toutes les frais\",IF(AND(Cup=\"X\",Sprache=\"Italiano\"),\"SWISS CUP !                                  Squadra di casa paga tutte le spese\",)))","v":0},null,null,null,null,null,null,null,null,null,null,null,{"$f":"IF(Sprache=\"Deutsch\",\"SCHIEDSRICHTERSPESEN    gemäss VR\",IF(Sprache=\"Français\",\"FRAIS D'ARBITRAGE    selon RV\",IF(Sprache=\"Italiano\",\"Nota spese arbitraggio    secondo RP\")))","v":"SCHIEDSRICHTERSPESEN    gemäss VR"}]
[]
[null,null,null,null,null,null,null,null,null,null,null,null,null,null,null,null,null,null,null,{"$f":"IF(Sprache=\"Deutsch\",\"Schiedsrichter 1L &  Swiss Cup\",IF(Sprache=\"Français\",\"Arbitres 1L &  Swiss Cup\",IF(Sprache=\"Italiano\",\"Arbitro 1L &  Swiss Cup\")))","v":"Schiedsrichter 1L &  Swiss Cup"},null,null,null,null,null,null,null,null,null,null,null,null,null,null,null,null,{"$f":"IF(Sprache=\"Deutsch\",\"Sprache:\",IF(Sprache=\"Français\",\"Langue:\",IF(Sprache=\"Italiano\",\"Lingua:\")))","v":"Sprache:"},"Deutsch"]
[]
[]
[]
[{"$f":"IF(Sprache=\"Deutsch\",\"Name und Vorname:\",IF(Sprache=\"Français\",\"Nom et prénom:\",IF(Sprache=\"Italiano\",\"Nome e cognome:\")))","v":"Name und Vorname:"}]
[]
[{"$f":"IF(Sprache=\"Deutsch\",\"Strasse und Nr.:\",IF(Sprache=\"Français\",\"Rue et numéro:\",IF(Sprache=\"Italiano\",\"Via e numero:\")))","v":"Strasse und Nr.:"},null,null,null,null,null,null,null,null,null,null,null,{"$f":"IFERROR(IF(M7=\"\",\"\",CONCATENATE(VLOOKUP(M7,schiedsrichterliste20211115!E:J,2,FALSE),\" \",VLOOKUP(M7,schiedsrichterliste20211115!E:J,3,FALSE))),\"Bitte *Name Vorname* eintragen\")","v":""},null,null,null,null,null,null,null,null,null,null,null,null,null,null,null,null,null,null,null,null,null,null,null,"Google Maps:",{"$f":"IF(OR(D11=\"\",M11=\"\",ISNA(VLOOKUP($M$13,HallenlisteSVRBESO!A:G,4,FALSE))),IF(Sprache=\"Deutsch\",\"(Link wählbar wenn Adresse und Halle eingetragen)\",IF(Sprache=\"Français\",\"(Link sélectionnable si l'adresse et la salle sont entrés)\",IF(Sprache=\"Italiano\",\"(Link selezionabile se l'indirizzo e la sala sono stati inseriti)\"))),IF(M7=\"\",\"\",HYPERLINK(CONCATENATE(\"https://www.google.ch/maps/dir/\",$M$9,\"+\",$D$11,\"+\",$M$11,\"/\",VLOOKUP($M$13,HallenlisteSVRBESO!A:G,4,FALSE),\"+\",VLOOKUP($M$13,HallenlisteSVRBESO!A:G,5,FALSE),\"+\",VLOOKUP($M$13,HallenlisteSVRBESO!A:G,6,FALSE),\"+\",VLOOKUP($M$13,HallenlisteSVRBESO!A:G,7,FALSE)),IF(Sprache=\"Deutsch\",CONCATENATE(\"von \",$M$11,\" nach \",$M$13),IF(Sprache=\"Français\",CONCATENATE(\"de \",$M$11,\" à \",$M$13),IF(Sprache=\"Italiano\",CONCATENATE(\"da \",$M$11,\" a \",$M$13)))))))","v":"(Link wählbar wenn Adresse und Halle eingetragen)"}]
[]
[{"$f":"IF(Sprache=\"Deutsch\",\"PLZ:\",IF(Sprache=\"Français\",\"NPA:\",IF(Sprache=\"Italiano\",\"NPA:\")))","v":"PLZ:"},null,null,{"$f":"IFERROR(IF(M7=\"\",\"\",VLOOKUP(M7,schiedsrichterliste20211115!E:J,5,FALSE)),\"\")","v":""},null,null,null,null,{"$f":"IF(Sprache=\"Deutsch\",\"Ort:\",IF(Sprache=\"Français\",\"Lieu:\",IF(Sprache=\"Italiano\",\"Posto:\")))","v":"Ort:"},null,null,null,{"$f":"IFERROR(IF(M7=\"\",\"\",VLOOKUP(M7,schiedsrichterliste20211115!E:J,6,FALSE)),\"\")","v":""},null,null,null,null,null,null,null,null,null,null,null,null,null,null,null,null,null,null,null,null,null,null,null,null,{"$f":"IF(Sprache=\"Deutsch\",\"Adresse der Halle muss im Google Maps eingetragen werden.           (z.B. Game Center NL oder Region)\",IF(Sprache=\"Français\",\"L'adresse de la salle doit être saisie dans Google Maps.                    (p.e. Game Center LN ou région)\",IF(Sprache=\"Italiano\",\"L'indirizzo della sala deve essere inserito in Google Maps.                   (p.e. Game Center LN o regione)\")))","v":"Adresse der Halle muss im Google Maps eingetragen werden.           (z.B. Game Center NL oder Region)"}]
[]
[{"$f":"IF(Sprache=\"Deutsch\",\"Datum:\",IF(Sprache=\"Français\",\"Date:\",IF(Sprache=\"Italiano\",\"Data:\")))","v":"Datum:"},null,null,null,null,null,null,null,null,null,{"$f":"IF(Sprache=\"Deutsch\",\"Halle:\",IF(Sprache=\"Français\",\"Salle:\",IF(Sprache=\"Italiano\",\"Sala:\")))","v":"Halle:"},null,null,null,null,null,null,null,null,null,null,null,null,null,null,null,null,null,null,{"$f":"IF(Sprache=\"Deutsch\",\"Zeit:\",IF(Sprache=\"Français\",\"Heure:\",IF(Sprache=\"Italiano\",\"Ora:\")))","v":"Zeit:"}]
[null,null,null,null,null,null,null,null,null,null,null,null,null,null,null,null,null,null,null,null,null,null,null,null,null,null,null,null,null,null,null,null,null,null,null,null,{"$f":"IF(Sprache=\"Deutsch\",\" X eintragen\n Bei Cup mit 2L oder tiefer nur Cup\",IF(Sprache=\"Français\",\" Entrez X\n Cup avec 2L ou moins seulement Cup\",IF(Sprache=\"Italiano\",\" Inserisci X\n CUP se 2 Lega o inferiore\")))","v":" X eintragen\n Bei Cup mit 2L oder tiefer nur Cup"}]
[{"$f":"IF(Sprache=\"Deutsch\",\"Spiel:\",IF(Sprache=\"Français\",\"Match:\",IF(Sprache=\"Italiano\",\"Match:\")))","v":"Spiel:"},null,null,null,null,null,null,null,null,null,null,null,"-",null,null,null,null,null,null,null,null,null,null,{"$f":"IF(Sprache=\"Deutsch\",\"NLA\",IF(Sprache=\"Français\",\"LNA\",IF(Sprache=\"Italiano\",\"LNA\")))","v":"NLA"},{"$f":"IF(Sprache=\"Deutsch\",\"NLB\",IF(Sprache=\"Français\",\"LNB\",IF(Sprache=\"Italiano\",\"LNB\")))","v":"NLB"},"1L","LR","Cup","RL",{"$f":"IF(Sprache=\"Deutsch\",\"Spiel-#:\",IF(Sprache=\"Français\",\"Match-#:\",IF(Sprache=\"Italiano\",\"Match-#:\")))","v":"Spiel-#:"},null,null,null,null,null,null,null,null,null,null,{"$f":"IF(Sprache=\"Deutsch\",\"Reiseentschädigung RL:\",IF(Sprache=\"Français\",\"Frais de déplacement RL:\",IF(Sprache=\"Italiano\",\"Indennità di viaggio RL:\")))","v":"Reiseentschädigung RL:"}]
[null,null,null,null,null,null,null,null,null,null,null,null,null,null,null,null,null,null,null,null,null,null,null,null,null,null,null,null,null,null,null,null,null,null,null,null,null,null,null,null,"0.70"]
[]
[null,null,null,null,null,null,null,null,null,null,null,null,null,null,null,null,null,null,null,null,null,null,null,null,null,null,null,null,null,null,null,null,null,null,null,null,{"$f":"IF(Sprache=\"Deutsch\",\" X eintragen wenn Doppelspiel (ohne Cup)\",IF(Sprache=\"Français\",\" Entrez X si double jeu (sans Cup)\",IF(Sprache=\"Italiano\",\" Inserisci X se doppio gioco (senza Cup)\")))","v":" X eintragen wenn Doppelspiel (ohne Cup)"}]
[{"$f":"IF(Sprache=\"Deutsch\",\"Reiseentschädigung:\",IF(Sprache=\"Français\",\"Frais de déplacement:\",IF(Sprache=\"Italiano\",\"Indennità di viaggio:\")))","v":"Reiseentschädigung:"},null,null,null,null,null,null,null,null,null,null,null,null,null,null,null,null,null,null,null,null,null,null,null,null,null,{"$f":"IF(Cup=\"X\",\"\",IF(Sprache=\"Deutsch\",\"Doppelspiel:\",IF(Sprache=\"Français\",\"Double jeu:\",IF(Sprache=\"Italiano\",\"Doppio gioco:\"))))","v":"Doppelspiel:"},null,null,null,"1L",null,"1L",null,null,null,null,null,null,null,{"$f":"IF(Sprache=\"Deutsch\",\"Spielleitung RL\",IF(Sprache=\"Français\",\"Direction de jeu RL\",IF(Sprache=\"Italiano\",\"Gioca direzione RL\")))","v":"Spielleitung RL"}]
[{"$f":"IF(OR(Liga1=\"X\",NLA=\"X\",NLB=\"X\",LR=\"X\"),IF(Sprache=\"Deutsch\",\"Pauschale:\",IF(Sprache=\"Français\",\"Forfaits:\",IF(Sprache=\"Italiano\",\"Forfait:\"))),IF(AND(Cup=\"X\",Liga1=\"\"),\"\",\"\"))","v":""},null,null,null,null,null,null,null,null,null,null,null,null,null,null,null,null,null,null,null,null,null,null,null,null,null,null,null,null,null,"1. Spiel",null,"2. Spiel",null,null,null,{"$f":"IF(Sprache=\"Deutsch\",\" 1./2. Spiel:\n NLA / NLB / 1L / LR=Linienrichter / RL=Regionalliga\",IF(Sprache=\"Français\",\" 1./2. jeu:\n LNA / LNB / 1L / LR=Juges de ligne / RL=ligues régionale\",IF(Sprache=\"Italiano\",\" 1./2. Spiel:\n LNA / LNB / 1L / LR=Giudici di linea / RL=leghe regionali\")))","v":" 1./2. Spiel:\n NLA / NLB / 1L / LR=Linienrichter / RL=Regionalliga"},null,null,null,60]
{"$rows_left_out":35}
{"sheet":"Doppelspiele","index":1,"n_rows":0,"n_cols":0,"rows_kept":0,"cut":false,"hidden":false,"merged":[]}

{"sheet":"HallenlisteSVRBESO","index":2,"n_rows":186,"n_cols":8,"rows_kept":186,"cut":false,"hidden":true,"merged":[]}
["Hallen","Halle #","Hallenname","H: Strasse","H: Hausnummer","H: PLZ","H: Ort","H: Region"]
[null," "," "," "," "," "," ","SVRBESO"]
[{"$f":"CONCATENATE(G3,\", \",C3)","v":"Aarberg, Aarolina"},1170,"Aarolina","Bürenstrasse",8,3270,"Aarberg","SVRBESO"]
["Aarberg, Sporthalle AARfit 1",1918,"Sporthalle AARfit 1","Aareweg",32,3270,"Aarberg","SVRBESO"]
["Aarberg, Sporthalle AARfit 2",2250,"Sporthalle AARfit 2","Aareweg ",32,3270,"Aarberg","SVRBESO"]
["Aarberg, Sporthalle AARfit 3",2249,"Sporthalle AARfit 3","Aareweg ",32,3270,"Aarberg","SVRBESO"]
["Aegerten, Mehrzweckhalle",1823,"Mehrzweckhalle","Mattenstrasse",16,2558,"Aegerten","SVRBESO"]
["Aeschi SO, Mehrzweckhalle",7,"Mehrzweckhalle","Schulhausstrasse",10,4556,"Aeschi SO","SVRBESO"]
["Aetigkofen, Turnhalle",1153,"Turnhalle","Schulgässli",6,4583,"Aetigkofen","SVRBESO"]
["Altbüron, MZH Hiltbrunnen",1415,"MZH Hiltbrunnen","Hiltbrunnen",17,6147,"Altbüron","SVRBESO"]
["Bern, Muristalden, alt",2024,"Muristalden, alt","Muristrasse ","8c",3006,"Bern","SVRBESO"]
["Bern, Bethlehemacker",272,"Bethlehemacker","Kornweg",109,3027,"Bern","SVRBESO"]
["Bern, Campus Muristalden (kleine Halle)",1686,"Campus Muristalden (kleine Halle)","Muristrasse","8c",3006,"Bern","SVRBESO"]
["Bern, Französische Schule ECLF",1618,"Französische Schule ECLF","Jupiterstrasse",2,3015,"Bern","SVRBESO"]
["Bern, Matte",157,"Matte","Schifflaube ",1,3011,"Bern","SVRBESO"]
["Bern, Muesmatt",1718,"Muesmatt","Gertrud-Woker-Strasse",5,3012,"Bern","SVRBESO"]
["Bern, Schönau",1172,"Schönau","Lindenauweg",1,3007,"Bern","SVRBESO"]
["Bern, Schwellenmätteli",26,"Schwellenmätteli","Schwellenmattstrasse ",1,3005,"Bern","SVRBESO"]
["Bern, Seminar Muristalden=neu Campus Muristalden",270,"Seminar Muristalden=neu Campus Muristalden","Muristrasse","8c",3006,"Bern","SVRBESO"]
["Bern, Sporthalle Weissenstein",1854,"Sporthalle Weissenstein","Könizstrasse",111,3008,"Bern","SVRBESO"]
{"$rows_left_out":167}
{"sheet":"schiedsrichterliste20211115","index":3,"n_rows":161,"n_cols":52,"rows_kept":161,"cut":false,"hidden":true,"merged":[]}
["#","SV-Nummer","Name","Vorname",null,"Strasse","Nummer","Postfach","Plz","Ort","Email","Email","Telefon","Fax","Mobile","Strasse G.","Nummer G.","Postfach G.","Plz G.","Ort G.","Email G.","Telefon G.","Fax G.","Mobile G.","Sprache","Jahrgang","Nationalität","Land","Letzte Änderung","Anz. Abs.","Letzter Login","Schiedsrichter für","Spieler bei/Trainer bei","Öffentliche Verkehrsmittel","Privates Verkehrsmittel","Nichtpflichtig","Pfeift keine","Nur Einzelspiele","Prüfungsdatum","Saison","Grad","Quali",null,"Gewünschter Grad","Gewünschte Quali","Dispensation","Nicht 2. Schiri","Exklusiv-Vereine","Anzahl Einsätze gewünscht","Anzahl Einsätze","Anzahl Doppel-Einsätze","Bemerkungen"]
[" "," "," "," "," "," "," "," "," "," "]
[3861,43961,"Aerni","Valerie",{"$f":"CONCATENATE(C3,\" \",D3)","v":"Aerni Valerie"},"Reichenbachstrasse",16,null,3004,"Bern","vali_aerni@hotmail.com",{"$f":"CONCATENATE(K3,\";\")","v":"vali_aerni@hotmail.com;"},null,null,"078 713 67 89",null,null,null,null,null,null,null,null,null,"D",1990,null,null,"2021-07-07T09:14:14",37,"2021-11-07T21:49:15","907075 VBC Bucheggberg (1 Mandate)","4L - f - VBC Bucheggberg",1,0,0,null,0,null,6,"N2",3,null,null,"Nein",0,null,"Normales Pensum",3,0,null,"Ich spiele noch in der Mixed Mannschaft vom VBC Bucheggberg"]
[4168,84694,"Aeschlimann","Leonie",{"$f":"CONCATENATE(C4,\" \",D4)","v":"Aeschlimann Leonie"},"Kirchweg ",9,null,3510,"Konolfingen","leonie.aeschli@gmail.com","leonie.aeschli@gmail.com;","031 791 38 19",null,"079 242 83 03",null,null,null,null,null,null,null,null,null,"D",2003,null,null,"2021-11-05T14:05:47",119,"2021-11-04T07:44:51","907350 VBC Konolfingen (0.5 Mandate)","4L - f - VBC Konolfingen, U23-2 - f - VBC Konolfingen",1,0,0,null,0,"2019-09-01",0,"N1",5,null,null,"Nein",0,null,"Halbes Pensum",1,0,"Ich bitte Sie, mir keine Spiele im Mehrzweckgebäude Gurzelen/Seftigen mehr zuzuteilen. Da die Halle weder mit dem ÖV noch zu Fuss gut erreichbar ist (vom Bahnhof Seftigen hat man zu Fuss ca. 20 Minuten) und ich noch nicht Autofahren kann resp. darf, ist der Weg nicht zumutbar. Vielen Dank für Ihr Verständnis","Ich bitte Sie, mir keine Spiele im Mehrzweckgebäude Gurzelen/Seftigen mehr zuzuteilen. Da die Halle weder mit dem ÖV noch zu Fuss gut erreichbar ist (vom Bahnhof Seftigen hat man zu Fuss ca. 20 Minuten) und ich noch nicht Autofahren kann resp. darf, ist der Weg nicht zumutbar. Vielen Dank für Ihr Verständnis"]
[3126,26679,"Al Kaabi","Ali","Al Kaabi Ali","Holenackerstrasse",31,null,3027,"Bern","ali.alkaabi1409@gmail.com","ali.alkaabi1409@gmail.com;",null,null,"078 695 45 33",null,null,null,null,null,null,null,null,null,"D",1968,null,null,"2021-08-29T20:36:26",45,"2021-11-11T17:38:13","907380 Volley Liebefeld (1.5 Mandate)",null,1,1,0,null,0,null,0,"N3",2,null,null,"Nein",0,null,"1½ Pensum",2,0]
[3950,85747,"Annaheim","Sandra","Annaheim Sandra","Grabenstrasse",7,null,3360,"Herzogenbuchsee","s.annaheim@hotmail.com","s.annaheim@hotmail.com;",null,null,"079 369 97 42",null,null,null,null,null,null,null,null,null,"D",2000,null,null,"2021-09-13T10:25:32",44,"2021-11-10T16:39:45","907920 VBC Langenthal (1 Mandate)","3L - f - VBC Herzogenbuchsee",1,1,0,null,0,"2018-09-25",0,"N1",4,null,null,"Nein",0,null,"Normales Pensum",9,0]
[4617,97169,"Artho","Bianca","Artho Bianca","Hofmattweg ",51,null,4710,"Balsthal","bianca.artho@gmail.com","bianca.artho@gmail.com;",null,null,"078 730 18 81",null,null,null,null,null,null,null,null,null,"D",2004,null,null,"2021-08-18T17:00:11",53,"2021-11-11T09:52:57","907545 VBG Welschenrohr (1 Mandate)","5L - f - VBG Welschenrohr",1,0,0,null,0,"2021-09-12",0,"N1",6,null,null,"Nein",0,null,"Normales Pensum",5,0]
[3862,53416,"Artho","Mara","Artho Mara","Kleinrieden",1,null,4713,"Matzendorf","mara.artho@bluewin.ch","mara.artho@bluewin.ch;","062 394 17 53",null,"077 453 12 65",null,null,null,null,null,null,null,null,null,"D",1999,null,null,"2021-05-26T10:30:15",93,"2021-11-11T18:30:13","907545 VBG Welschenrohr (0.5 Mandate)","3L pro - f - VBG Welschenrohr",0,1,0,null,0,null,3,"N2",2,null,null,"Nein",0,null,"Halbes Pensum",3,0,"Besuche eine Weiterbildung und habe deshalb jeweils am Samstag bis 12:00 Uhr in Bern (Wankdorf) Schule. Kann deshalb am Samstag erst am Nachmittag ab 15:00 Uhr Spiele leiten. In der Region Bern allenfalls Spiele mit früherer Anspielzeit. DANKE!"]
[4435,101995,"Asllani","Luljeta","Asllani Luljeta","Bahnhofstrasse ",22,null,3800,"Interlaken","sul.luljeta@gmail.com","sul.luljeta@gmail.com;",null,null,"079 576 77 07",null,null,null,null,null,null,null,null,null,"D",1994,null,null,"2021-08-30T14:41:54",153,"2021-11-11T22:55:53","907750 SV Strättligen (1 Mandate)",null,0,1,0,null,0,"2020-09-20",0,"N1",6,null,null,"Nein",0,null,"Normales Pensum",8,0,"Blutiger Anfänger :)  ","Prinzipiell pfeife ich keine regionalen Einsätze. Ich gebe meine Punkte aber Uni Bern. Allenfalls nehme ich mal ein Spiel aus der Börse. Merci!"]
[4645,91998,"Avdullahu","Aldrina","Avdullahu Aldrina","Steingasse ",1,null,4934,"Madiswil","aldrina.avdullahu@hotmail.ch","aldrina.avdullahu@hotmail.ch;",null,null,"079 122 07 06",null,null,null,null,null,null,null,null,null,"D",2000,null,null,null,14,"2021-11-09T09:18:39","907920 VBC Langenthal (1 Mandate)","U23-2 - f - VBC Langenthal",1,1,0,null,0,"2021-09-18",0,"N1",6,null,null,"Nein",0,null,"Normales Pensum",5,0]
[3951,93195,"Bachmann","Célina","Bachmann Célina","Blüemlisalpweg",14,null,3123,"Belp","celicelina@belponline.ch","celicelina@belponline.ch;",null,null,"079 194 52 27",null,null,null,null,null,null,null,null,null,"D",2000,null,null,"2019-09-02T22:39:06",151,"2021-09-20T13:02:34","907440 VBC Münsingen (0.5 Mandate)","U23-1 - f - VBC Münsingen, 4L - f - VBC Münsingen",1,0,0,null,0,null,0,"N1",4,null,null,"Nein",0,null,"Halbes Pensum",0,0,"12.09.21 A. Sigrist: Kein Covid-Zertifikat","Bitte um selber matchs auswählen, wie bei der umfrage geschrieben!  Habe andy meine wünsche schon durchgegeben und hoffe es klappt so :-)"]
[3214,185203,"Bachmann","Claudia","Bachmann Claudia","Stegmattweg",3,null,3032,"Hinterkappelen","cla83bach@bluewin.ch","cla83bach@bluewin.ch;",null,null,"078 897 48 89",null,null,null,null,null,null,null,null,null,"D",1983,null,null,"2020-08-26T15:43:04",51,"2021-11-11T13:20:30","907730 STB Volley (1 Mandate)",null,0,1,0,null,0,null,0,"N3",2,null,null,"Nein",0,null,"Normales Pensum",1,0,"ich wäre sehr froh wenn ich die matchs wieder selber aussuchen könnte die ich pfeiffen möchte, hilft mir beim organisieren mit kindern, selber match und unregelmässiger arbeit...   ","Ich habe in diesem Jahr meine Abschlussprüfungen und wede aus diesem grund nur ein Halbes Mandat pfeiffen. Am liebsten pfeiffe ich 2 Matche an einem stück so loht sich der zeitliche aufwand für mich. Ich werde ebenso relativ viele sperdaten eingeben und mir meine Matche spontan aus der Börse holen wen ich sehe das ein Zeitfenster fürs Volleyball frei wird. "]
[4644,74101,"Bachmann","Melina","Bachmann Melina","Eymatt",1,null,3662,"Seftigen","melina.bachmann@gmx.net","melina.bachmann@gmx.net;",null,null,"079 157 12 84",null,null,null,null,null,null,null,null,null,"D",2003,null,null,"2021-09-05T20:36:30",130,"2021-11-06T08:20:35","907647 VBC Seftigen (1 Mandate)","4L - f - VBC Seftigen",1,1,0,null,0,"2021-08-29",0,"N1",6,null,null,"Nein",0,null,"Normales Pensum",6,0]
[3556,36237,"Badertscher","Stephanie","Badertscher Stephanie","Kreuzmatt",7,null,3507,"Biglen","baderstephi@gmail.com","baderstephi@gmail.com;","031 711 27 80",null,"079 962 08 75",null,null,null,null,null,null,null,null,null,"D",1995,null,null,"2020-08-03T22:29:43",120,"2021-11-11T21:39:10","907270 VBC Grosshöchstetten (1 Mandate)","3L pro - f - VBC Grosshöchstetten",0,1,0,null,0,"2017-09-03",0,"N1",3,null,null,"Nein",0,null,"Normales Pensum",5,0,"Ich würde gerne den nächsten Schitsrichterkurs N2 besuchen damit ich auch höhere stufen pfeiffen kann. "]
[4424,35500,"Béboux","Francis","Béboux Francis","Jean-Sessler-Strasse",2,null,2502,"Biel","francis.beboux@hotmail.com","francis.beboux@hotmail.com;","041 340 06 60",null,"079 101 63 94",null,null,null,null,null,null,null,null,null,"D",1994,null,null,"2021-10-11T18:37:26",56,"2021-11-08T17:49:05","907820 VBC Uni Bern  (1 Mandate)","2L - m - VBC Uni Bern",1,0,0,null,0,"2020-09-20",0,"N1",6,null,null,"Nein",0,null,"Normales Pensum",4,0]
[4643,74103,"Becker","Anouk","Becker Anouk","Seematte",17,null,3116,"Kirchdorf","anoukbecker@bluewin.ch","anoukbecker@bluewin.ch;",null,null,"079 652 26 62",null,null,null,null,null,null,null,null,null,"D",2004,null,null,"2021-09-17T13:32:53",91,"2021-11-11T08:01:35","907647 VBC Seftigen (1 Mandate)",null,1,1,0,null,0,"2021-08-29",0,"N1",6,null,null,"Nein",0,null,"Normales Pensum",5,0]
[4759,113615,"Becker","Lea","Becker Lea","Grimmengasse",4,null,4500,"Solothurn","becker.lea@gmx.de","becker.lea@gmx.de;",null,null,"+49 170 4619245",null,null,null,null,null,null,null,null,null,"D",1988,null,null,"2021-08-28T16:28:30",205,"2021-11-10T10:24:50","907810 VC Uettligen (0.5 Mandate)",null,1,1,0,null,0,null,0,"N",1,null,null,"Nein",0,null,"Halbes Pensum",0,0]
[4425,66173,"Berger","Lia","Berger Lia","Stadtacker ",11,null,4629,"Fulenbach","lia.a.berger@gmail.com","lia.a.berger@gmail.com;",null,null,"078 408 14 73",null,null,null,null,null,null,null,null,null,"D",2004,null,null,"2021-09-14T12:53:58",150,"2021-11-08T22:44:54","907181 Hägendorf TUS (1 Mandate)","3L - f - Hägendorf TUS",1,0,0,null,0,"2020-09-20",0,"N1",6,null,null,"Nein",0,null,"Normales Pensum",1,0,"14.09.21 A. Sigrist: Kein Covid-Zertifikat 08.10.21 A. Sigrist: Zertifikat ab 25.10.","20.08.2020 Wenn möglich keine Spiele in Langnau,Schwarzenburg und Oberdiessbach ab 17uhr meine öv verbindungen sind nicht so gut,bitte beachten die MZH3Höfe in Heinrichswil-Winistorf ist am Samstage mit öv nicht erreichbar es gibt gar keine Verbindung.LG Beno"]
[4642,80252,"Bickel","Rebecca","Bickel Rebecca","Bümplizstrasse ",84,null,3018,"Bern","re.bi99@bluewin.ch","re.bi99@bluewin.ch;",null,null,"079 740 21 80",null,null,null,null,null,null,null,null,null,"D",1999,null,null,"2021-08-23T11:04:09",72,"2021-11-08T08:59:58","907370 VT Langnau (1 Mandate)","5L - f - VT Langnau",0,1,0,null,0,"2021-09-18",0,"N1",6,null,null,"Nein",0,null,"Normales Pensum",1,0,"Da ich in der Pflege arbeite, habe ich bis im November viele Absenzen, da ich keine Frei oder Dienst wünsche eingeben kann. Ich hoffe, dass dies berücksichtigt werden kann. "]
[4606,212339,"Bockstaller","Tobias","Bockstaller Tobias","Viktoriastrasse",84,null,3013,"Bern","tobias.bockstaller@gmail.com","tobias.bockstaller@gmail.com;",null,null,"079 280 81 29",null,null,null,null,null,null,null,null,null,"D",1987,null,null,"2021-08-25T08:03:03",65,"2021-11-11T12:00:28","907820 VBC Uni Bern  (1 Mandate)","2L - m - VBC Uni Bern",1,0,0,null,0,null,0,"N3",2,null,null,"Nein",0,null,"Normales Pensum",1,0,"Ich bin bereits ausgebildeter Linienrichter und würde auch Einsätze übernehmen, falls es da welche gibt."]
{"$rows_left_out":142}
{"sheet":"Regionen","index":4,"n_rows":15,"n_cols":14,"rows_kept":15,"cut":false,"hidden":true,"merged":[]}
["Regionen",null,null,null,"Sprachen",null,"Doppelspiel",null,"Sprache",null,"Entschädigung RL",null,null,"Spesen RL / km"]
["SV Region Aargau","SVRA",null,null,"Deutsch",null,{"$f":"IF(I2=\"Deutsch\",\"NLA\",IF(I2=\"Français\",\"LNA\",IF(I2=\"Italiano\",\"LNA\")))","v":"NLA"},null,{"$f":"SSK_Spesenblatt!Sprache","v":"Deutsch"},null,"2L",60,null,0.7]
["SV Region Bern-Solothurn","SVRBESO",null,null,"Français",null,{"$f":"IF(I2=\"Deutsch\",\"NLB\",IF(I2=\"Français\",\"LNB\",IF(I2=\"Italiano\",\"LNB\")))","v":"NLB"},null,null,null,"3L",50]
["SV Region Basel","SVRBS",null,null,"Italiano",null,{"$f":"IF(I2=\"Deutsch\",\"1L\",IF(I2=\"Français\",\"1L\",IF(I2=\"Italiano\",\"1L\")))","v":"1L"},null,null,null,"4L",50]
["SV Region Freiburg","SVRF",null,null,null,null,{"$f":"IF(I2=\"Deutsch\",\"LR\",IF(I2=\"Français\",\"LR\",IF(I2=\"Italiano\",\"LR\")))","v":"LR"},null,null,null,"5L",50]
["SV Region Genf","SVRGE",null,null,null,null,{"$f":"IF(I2=\"Deutsch\",\"RL\",IF(I2=\"Français\",\"RL\",IF(I2=\"Italiano\",\"RL\")))","v":"RL"}]
["SV Region GSGL","GSGL"]
["SV Region Innerschweiz","SVRI"]
["SV Region Jura-Seeland","SVRJS"]
["SV Region Neuenburg","SVRN"]
["SV Region Nord-Ostschweiz","SVRNO"]
["SV Region Tessin und Moesa","SVRT"]
["SV Region Waadt","SVRV"]
["SV Region Wallis","SVRVS"]
["SV Region Zürich","SVRZ"]